BDBM50481188 CHEMBL571993
SMILES CN1CCN(CC1)c1cccc(c1)C(=O)\C=C\c1cccc(\C=C\C(=O)NO)c1
InChI Key InChIKey=ILNZTCJWQPCPCA-GFULKKFKSA-N
Data  1 IC50
  Tab Delimited (TSV)   2D SDfile   Computed 3D by Vconf -m prep SDfile
Find this compound or compounds like it in BindingDB:
Activity Spreadsheet -- Enzyme Inhibition Constant Data from BindingDB
Found 1 hit for monomerid = 50481188
TargetHistone deacetylase(Homo sapiens (Human))
Congenia
Curated by ChEMBL
LigandPNGBDBM50481188(CHEMBL571993)
Affinity DataIC50:  20nM. Assay description: Inhibition of human HDAC extracted from human HeLa cells
Ligand InfoPC cidPC sid
In DepthDetails ArticlePubMed