BDBM50481196 CHEMBL569749
SMILES CN1CCN(CC1)c1ccc(cc1)C(=O)\C=C\c1ccc(\C=C\C(=O)NO)nc1
InChI Key InChIKey=OWDZTIMMVGZNDB-OTNQEUJLSA-N
Data  1 IC50
  Tab Delimited (TSV)   2D SDfile   Computed 3D by Vconf -m prep SDfile
Find this compound or compounds like it in BindingDB:
Activity Spreadsheet -- Enzyme Inhibition Constant Data from BindingDB
Found 1 hit for monomerid = 50481196
TargetHistone deacetylase(Homo sapiens (Human))
Congenia
Curated by ChEMBL
LigandPNGBDBM50481196(CHEMBL569749)
Affinity DataIC50:  175nM. Assay description: Inhibition of human HDAC extracted from human HeLa cells
Ligand InfoPC cidPC sid
In DepthDetails ArticlePubMed