BDBM50482693 CHEMBL388638
SMILES CC(C)(C)NC(=O)C(=C/Nc1ccc(Cl)cc1)\C(=O)c1ccccc1Cl
InChI Key InChIKey=WOXFPACRGTYYBT-VBKFSLOCSA-N
Data  1 IC50
  Tab Delimited (TSV)   2D SDfile   Computed 3D by Vconf -m prep SDfile
Find this compound or compounds like it in BindingDB:
Activity Spreadsheet -- Enzyme Inhibition Constant Data from BindingDB
Found 1 hit for monomerid = 50482693
TargetGamma-aminobutyric acid receptor subunit alpha-1/beta-2/gamma-2(Rattus norvegicus (Rat))
Wuhan Institute Of Technology
Curated by ChEMBL
LigandPNGBDBM50482693(CHEMBL388638)
Affinity DataIC50:  3.02E+3nM. Assay description: Inhibition of rat GABA alpha-1-beta-2-gamma-2 receptor
Ligand InfoPC cidPC sid
In DepthDetails ArticlePubMed