BDBM50483617 CHEMBL1760914
SMILES ONC(=O)CCCC1CCN(CC1)C(=O)Nc1ccccc1
InChI Key InChIKey=HUMIXIBITBNDHE-UHFFFAOYSA-N
Data  1 IC50
  Tab Delimited (TSV)   2D SDfile   Computed 3D by Vconf -m prep SDfile
Find this compound or compounds like it in BindingDB:
Activity Spreadsheet -- Enzyme Inhibition Constant Data from BindingDB
Found 1 hit for monomerid = 50483617
TargetHistone deacetylase(Homo sapiens (Human))
Menarini Ricerche Pomezia
Curated by ChEMBL
LigandPNGBDBM50483617(CHEMBL1760914)
Affinity DataIC50:  100nM. Assay description: Inhibition of HDAC in human HeLa cells by fluorescent activity assay
Ligand InfoPC cidPC sid
In DepthDetails ArticlePubMed