BDBM50485310 FLUTAFURANOL
SMILES CNc1ccc(-c2cc3cc(O)ccc3o2)c(F)n1
InChI Key InChIKey=MYNQXTDIPMCJCR-UHFFFAOYSA-N
Data  1 IC50
  Tab Delimited (TSV)   2D SDfile   Computed 3D by Vconf -m prep SDfile
Find this compound or compounds like it in BindingDB:
Activity Spreadsheet -- Enzyme Inhibition Constant Data from BindingDB
Found 1 hit for monomerid = 50485310
TargetAmyloid-beta precursor protein(Homo sapiens (Human))
Astrazeneca
Curated by ChEMBL
LigandPNGBDBM50485310(FLUTAFURANOL)
Affinity DataIC50:  24nM. Assay description: Displacement of [3H]AZD2184 from human amyloid beta(1 to 40)
In DepthDetails ArticlePubMed