BDBM50485832 CHEMBL2170487
SMILES C[C@H](O)C(=O)N1CCC(CCn2c(Sc3cc4OCCOc4cc3Br)nc3c(N)ncnc23)CC1
InChI Key InChIKey=VJSOUGMQBHUKBW-ZDUSSCGKSA-N
Data  2 IC50
  Tab Delimited (TSV)   2D SDfile   Computed 3D by Vconf -m prep SDfile
Find this compound or compounds like it in BindingDB:
Activity Spreadsheet -- Enzyme Inhibition Constant Data from BindingDB
Found 2 hits for monomerid = 50485832
TargetHeat shock protein HSP 90-alpha/90-beta(Homo sapiens (Human))
Myrexis
Curated by ChEMBL
LigandPNGBDBM50485832(CHEMBL2170487)
Affinity DataIC50:  150nM. Assay description: Inhibition of human HSP90 using BODIPY labelled geldanamycin as substrate by fluorescence polarization assay
Ligand InfoPC cidPC sid
In DepthDetails ArticlePubMed
TargetHeat shock protein HSP 90-alpha/90-beta(Homo sapiens (Human))
Myrexis
Curated by ChEMBL
LigandPNGBDBM50485832(CHEMBL2170487)
Affinity DataIC50:  74nM. Assay description: Inhibition of human HSP90 in HCT116 cells expressing Her2 gene assessed as degradation of Her2 after 4 hrs by luciferase reporter gene assay
Ligand InfoPC cidPC sid
In DepthDetails ArticlePubMed