BDBM50486118 CHEMBL2204004
SMILES CCc1cc(-c2ccc(C)o2)n(n1)-c1ccc2n(Cc3ccc(=O)[nH]c3)c(nc2c1)-c1ccccc1O
InChI Key InChIKey=HXRJJGLHNMSADA-UHFFFAOYSA-N
Data  2 IC50
  Tab Delimited (TSV)   2D SDfile   Computed 3D by Vconf -m prep SDfile
Find this compound or compounds like it in BindingDB:
Activity Spreadsheet -- Enzyme Inhibition Constant Data from BindingDB
Found 2 hits for monomerid = 50486118
TargetStructural capsid protein(Human immunodeficiency virus 1)
Boehringer Ingelheim (Canada)
Curated by ChEMBL
LigandPNGBDBM50486118(CHEMBL2204004)
Affinity DataIC50:  55nM. Assay description: Inhibition of HIV1 capsid protein assembly using 5'-fluorescein-labeled (TG)25 oligonucleotide after 2 hrs by fluorometry-based capsid disassembly as...
Ligand InfoPC cidPC sid
In DepthDetails ArticlePubMed
TargetStructural capsid protein(Human immunodeficiency virus 1)
Boehringer Ingelheim (Canada)
Curated by ChEMBL
LigandPNGBDBM50486118(CHEMBL2204004)
Affinity DataIC50:  690nM. Assay description: Inhibition of HIV1 capsid protein binding to fluorescein labeled 3-(5-(3-ethyl-5-(5-methylfuran-2-yl)-1H-pyrazol-1-yl)-1-((6-oxo-1,6-dihydropyridin-3...
Ligand InfoPC cidPC sid
In DepthDetails ArticlePubMed