BDBM50486119 CHEMBL2204010
SMILES CCc1cc(-c2ccc(o2)C(F)(F)F)n(n1)-c1ccc2n(Cc3c[nH]c(=O)c(C)c3)c(nc2c1)-c1cc(ccc1O)C(=O)N1CCCC1
InChI Key InChIKey=ZWMIQSOCDYLOJO-UHFFFAOYSA-N
Data  1 IC50
  Tab Delimited (TSV)   2D SDfile   Computed 3D by Vconf -m prep SDfile
Find this compound or compounds like it in BindingDB:
Activity Spreadsheet -- Enzyme Inhibition Constant Data from BindingDB
Found 1 hit for monomerid = 50486119
TargetStructural capsid protein(Human immunodeficiency virus 1)
Boehringer Ingelheim (Canada)
Curated by ChEMBL
LigandPNGBDBM50486119(CHEMBL2204010)
Affinity DataIC50:  38nM. Assay description: Inhibition of HIV1 capsid protein binding to fluorescein labeled 3-(5-(3-ethyl-5-(5-methylfuran-2-yl)-1H-pyrazol-1-yl)-1-((6-oxo-1,6-dihydropyridin-3...
Ligand InfoPC cidPC sid
In DepthDetails ArticlePubMed