BDBM50486135 CHEMBL2204006
SMILES CCc1cc(-c2ccc(C)o2)n(n1)-c1ccc2n(Cc3ccc(=O)[nH]c3)c(nc2c1)-c1cc(ccc1O)C(O)=O
InChI Key InChIKey=URCIOERTSWRWBE-UHFFFAOYSA-N
Data  2 IC50
PDB links: 1 PDB ID matches this monomer.
  Tab Delimited (TSV)   2D SDfile   Computed 3D by Vconf -m prep SDfile
Find this compound or compounds like it in BindingDB:
Activity Spreadsheet -- Enzyme Inhibition Constant Data from BindingDB
Found 2 hits for monomerid = 50486135
TargetStructural capsid protein(Human immunodeficiency virus 1)
Boehringer Ingelheim (Canada)
Curated by ChEMBL
LigandPNGBDBM50486135(CHEMBL2204006)
Affinity DataIC50:  56nM. Assay description: Inhibition of HIV1 capsid protein assembly using 5'-fluorescein-labeled (TG)25 oligonucleotide after 2 hrs by fluorometry-based capsid disassembly as...
Ligand InfoPC cidPC sidPDB
In DepthDetails ArticlePubMed
TargetStructural capsid protein(Human immunodeficiency virus 1)
Boehringer Ingelheim (Canada)
Curated by ChEMBL
LigandPNGBDBM50486135(CHEMBL2204006)
Affinity DataIC50:  650nM. Assay description: Inhibition of HIV1 capsid protein binding to fluorescein labeled 3-(5-(3-ethyl-5-(5-methylfuran-2-yl)-1H-pyrazol-1-yl)-1-((6-oxo-1,6-dihydropyridin-3...
Ligand InfoPC cidPC sidPDB
In DepthDetails ArticlePubMed