BDBM50486442 CHEMBL252578
SMILES CCOC(=O)c1c(C)nc2nc3CCCCCc3c(N)c2c1-c1ccc(F)cc1
InChI Key InChIKey=FAGLJGFRSMDZBW-UHFFFAOYSA-N
Data  3 IC50
  Tab Delimited (TSV)   2D SDfile   Computed 3D by Vconf -m prep SDfile
Find this compound or compounds like it in BindingDB:
Activity Spreadsheet -- Enzyme Inhibition Constant Data from BindingDB
Found 3 hits for monomerid = 50486442
TargetAcetylcholinesterase(Homo sapiens (Human))TBA
LigandPNGBDBM50486442(CHEMBL252578)
Affinity DataIC50:  5.37E+3nM. Assay description: Inhibition of AChE (unknown origin) using acetylthiocholine chloride as substrate after 15 min by Ellman's method
Ligand InfoPC cidPC sid
In DepthDetails Article
TargetVoltage-dependent L-type calcium channel subunit alpha-1F(Homo sapiens (Human))
Hospital Universitario De La Princesa
Curated by ChEMBL
LigandPNGBDBM50486442(CHEMBL252578)
Affinity DataIC50:  1.70E+4nM. Assay description: Inhibition of VGCC (unknown origin)
Ligand InfoPC cidPC sid
In DepthDetails ArticlePubMed
TargetAcetylcholinesterase(Electrophorus electricus (Electric eel))
Hospital Universitario De La Princesa
Curated by ChEMBL
LigandPNGBDBM50486442(CHEMBL252578)
Affinity DataIC50:  5.40E+3nM. Assay description: Inhibition of electric eel AChE
Ligand InfoPC cidPC sid
In DepthDetails ArticlePubMed