BDBM50486504 CHEMBL400675
SMILES CCOC(=O)c1c(C)nc2nc3CCCCc3c(N)c2c1-c1cccc(c1)[N+]([O-])=O
InChI Key InChIKey=YCHHFZRJBHOKQX-UHFFFAOYSA-N
Data  4 IC50
  Tab Delimited (TSV)   2D SDfile   Computed 3D by Vconf -m prep SDfile
Find this compound or compounds like it in BindingDB:
Activity Spreadsheet -- Enzyme Inhibition Constant Data from BindingDB
Found 4 hits for monomerid = 50486504
TargetAcetylcholinesterase(Homo sapiens (Human))TBA
LigandPNGBDBM50486504(CHEMBL400675)
Affinity DataIC50:  933nM. Assay description: Inhibition of AChE (unknown origin) using acetylthiocholine chloride as substrate after 15 min by Ellman's method
Ligand InfoPC cidPC sid
In DepthDetails Article
TargetVoltage-dependent L-type calcium channel subunit alpha-1F(Homo sapiens (Human))
Hospital Universitario De La Princesa
Curated by ChEMBL
LigandPNGBDBM50486504(CHEMBL400675)
Affinity DataIC50:  1.80E+4nM. Assay description: Inhibition of VGCC (unknown origin)
Ligand InfoPC cidPC sid
In DepthDetails ArticlePubMed
TargetCholinesterase(Homo sapiens (Human))
Hospital Universitario De La Princesa
Curated by ChEMBL
LigandPNGBDBM50486504(CHEMBL400675)
Affinity DataIC50:  2.10E+4nM. Assay description: Inhibition of BuChE (unknown origin)
Ligand InfoPC cidPC sid
In DepthDetails ArticlePubMed
TargetAcetylcholinesterase(Electrophorus electricus (Electric eel))
Hospital Universitario De La Princesa
Curated by ChEMBL
LigandPNGBDBM50486504(CHEMBL400675)
Affinity DataIC50:  900nM. Assay description: Inhibition of electric eel AChE
Ligand InfoPC cidPC sid
In DepthDetails ArticlePubMed