BDBM50487172 CHEMBL2251944
SMILES Cc1cc2nc(nn2c(C)n1)S(=O)(=O)Nc1ccc(F)c(F)c1F
InChI Key InChIKey=MBMXVCFWGHEUMJ-UHFFFAOYSA-N
Data  1 KI
  Tab Delimited (TSV)   2D SDfile   Computed 3D by Vconf -m prep SDfile
Find this compound or compounds like it in BindingDB:
Activity Spreadsheet -- Enzyme Inhibition Constant Data from BindingDB
Found 1 hit for monomerid = 50487172
TargetAcetolactate synthase, chloroplastic(Arabidopsis thaliana)
Central China Normal University
Curated by ChEMBL
LigandPNGBDBM50487172(CHEMBL2251944)
Affinity DataKi: >1.00E+6nM. Assay description: Inhibition of wild type Arabidopsis thaliana acetolactate synthase by colorimetry
Ligand InfoPC cidPC sid
In DepthDetails ArticlePubMed