BDBM50487312 BUTHIONINE SULFOXIME
SMILES CCCCS(=N)(=O)CC[C@H](N)C(O)=O
InChI Key InChIKey=KJQFBVYMGADDTQ-CVSPRKDYSA-N
Data  2 KI
PDB links: 1 PDB ID matches this monomer.
  Tab Delimited (TSV)   2D SDfile   Computed 3D by Vconf -m prep SDfile
Find this compound or compounds like it in BindingDB:
Activity Spreadsheet -- Enzyme Inhibition Constant Data from BindingDB
Found 2 hits for monomerid = 50487312
TargetGlutamate--cysteine ligase(Onchocerca volvulus)TBA
LigandPNGBDBM50487312(BUTHIONINE SULFOXIME)
Affinity DataKi:  7.70E+6nM. Assay description: Inhibition of Setaria cervi glutamate cysteine ligase using glutamate as substrate incubated for 10 min prior to substrate addition measured for 5 mi...
In DepthDetails Article
LigandPNGBDBM50487312(BUTHIONINE SULFOXIME)
Affinity DataKi:  1.30E+7nM. Assay description: Inhibition of Rattus norvegicus Wistar (rat) rat glutamate cysteine ligase using glutamate as substrate incubated for 10 min prior to substrate addit...
In DepthDetails Article