BDBM50488911 CHEMBL2298025
SMILES NS(=O)(=O)c1ccc(NC(=S)NC(=O)c2cc(ccc2Cl)[N+]([O-])=O)cc1
InChI Key InChIKey=KZTQXHJTRKKEEJ-UHFFFAOYSA-N
Data  1 KI
  Tab Delimited (TSV)   2D SDfile   Computed 3D by Vconf -m prep SDfile
Find this compound or compounds like it in BindingDB:
Activity Spreadsheet -- Enzyme Inhibition Constant Data from BindingDB
Found 1 hit for monomerid = 50488911
TargetUrease(Canavalia ensiformis (Jack bean) (Horse bean))TBA
LigandPNGBDBM50488911(CHEMBL2298025)
Affinity DataKi:  440nM. Assay description: Inhibition of Canavalia ensiformis (jack bean) urease assessed as release of ammonia after 30 min by indophenol method
Ligand InfoPC cidPC sid
In DepthDetails Article