BDBM50489049 CHEMBL2299195
SMILES S=c1oc(cc2ccccc12)-c1cccs1
InChI Key InChIKey=WHOKEJXCPYYSOH-UHFFFAOYSA-N
Data  1 IC50
  Tab Delimited (TSV)   2D SDfile   Computed 3D by Vconf -m prep SDfile
Find this compound or compounds like it in BindingDB:
Activity Spreadsheet -- Enzyme Inhibition Constant Data from BindingDB
Found 1 hit for monomerid = 50489049
TargetLactoperoxidase(Bos taurus (Bovine))TBA
LigandPNGBDBM50489049(CHEMBL2299195)
Affinity DataIC50:  1.43E+4nM. Assay description: Inhibition of Bos taurus (bovine) milk lactoperoxidase-catalyzed iodination of L-tyrosine substrate by reverse phase HPLC analysis
Ligand InfoPC cidPC sid
In DepthDetails Article