BDBM50490735 CHEMBL1863002::DNDI1449875
SMILES Fc1cc(Cl)ccc1C(N1CCN(CC1)C(=O)Nc1ccc(Cl)cc1)c1cncnc1
InChI Key InChIKey=BVCJFLBXIQLILO-UHFFFAOYSA-N
Data  1 IC50
  Tab Delimited (TSV)   2D SDfile   Computed 3D by Vconf -m prep SDfile
Find this compound or compounds like it in BindingDB:
Activity Spreadsheet -- Enzyme Inhibition Constant Data from BindingDB
Found 1 hit for monomerid = 50490735
TargetCytochrome P450 3A4/3A5(Homo sapiens (Human))
Epichem
Curated by ChEMBL
LigandPNGBDBM50490735(CHEMBL1863002 | DNDI1449875)
Affinity DataIC50:  300nM. Assay description: Inhibition of CYP3A4/5 in human liver microsomes assessed as reduction in testosterone-beta-hydroxylation
Ligand InfoPC cidPC sid
In DepthDetails ArticlePubMed