BDBM50490739 CHEMBL1862975::DNDI1335908
SMILES CC(=O)N1CCN(CC1)C(c1ccc(Cl)cc1)c1cccnc1
InChI Key InChIKey=GJKBXMHXMVVKPG-UHFFFAOYSA-N
Data  1 IC50
  Tab Delimited (TSV)   2D SDfile   Computed 3D by Vconf -m prep SDfile
Find this compound or compounds like it in BindingDB:
Activity Spreadsheet -- Enzyme Inhibition Constant Data from BindingDB
Found 1 hit for monomerid = 50490739
TargetCytochrome P450 3A4/3A5(Homo sapiens (Human))
Epichem
Curated by ChEMBL
LigandPNGBDBM50490739(CHEMBL1862975 | DNDI1335908)
Affinity DataIC50:  7.40E+3nM. Assay description: Inhibition of CYP3A4/5 in human liver microsomes assessed as reduction in testosterone-beta-hydroxylation
Ligand InfoPC cidPC sid
In DepthDetails ArticlePubMed