BDBM50490997 CHEMBL2377337
SMILES CCN(CC)C(=O)C1Sc2ccc(F)cc2-c2c1c1ccccc1n2CCF
InChI Key InChIKey=UFIIMXHKOVDWOD-UHFFFAOYSA-N
Data  1 KI
  Tab Delimited (TSV)   2D SDfile   Computed 3D by Vconf -m prep SDfile
Find this compound or compounds like it in BindingDB:
Activity Spreadsheet -- Enzyme Inhibition Constant Data from BindingDB
Found 1 hit for monomerid = 50490997
TargetTranslocator protein(Rattus norvegicus (rat))
Ge Healthcare
Curated by ChEMBL
LigandPNGBDBM50490997(CHEMBL2377337)
Affinity DataKi:  0.390nM. Assay description: Displacement of [3H]PK11195 from PBR receptor in Wistar rat heart homogenates
Ligand InfoPC cidPC sid
In DepthDetails ArticlePubMed