BDBM50491169 CHEMBL2377164
SMILES Oc1ccc(cc1)C1=COc2c(O)c(O)ccc2C1
InChI Key InChIKey=FNWFQALKJWWHGK-UHFFFAOYSA-N
Data  1 KI  1 IC50
  Tab Delimited (TSV)   2D SDfile   Computed 3D by Vconf -m prep SDfile
Find this compound or compounds like it in BindingDB:
Activity Spreadsheet -- Enzyme Inhibition Constant Data from BindingDB
Found 2 hits for monomerid = 50491169
TargetUrease subunit beta(Helicobacter pylori (strain ATCC 700392 / 26695) (...)
Jishou University
Curated by ChEMBL
LigandPNGBDBM50491169(CHEMBL2377164)
Affinity DataKi:  641nM. Assay description: Competitive inhibition of Helicobacter pylori ATCC 43504 urease using urea as substrate by Lineweaver-Burk/Dixon plot analysis
Ligand InfoPC cidPC sid
In DepthDetails ArticlePubMed
TargetUrease subunit beta(Helicobacter pylori (strain ATCC 700392 / 26695) (...)
Jishou University
Curated by ChEMBL
LigandPNGBDBM50491169(CHEMBL2377164)
Affinity DataIC50:  850nM. Assay description: Inhibition of Helicobacter pylori ATCC 43504 urease-mediated ammonia production preincubated for 1.5 hrs by indophenol method
Ligand InfoPC cidPC sid
In DepthDetails ArticlePubMed