BDBM50491665 CHEMBL2387158
SMILES CCN1c2ccc(cc2N(c2ccccc2)C(=O)N(c2ccc(OC)cc2)C1=O)C(F)(F)F
InChI Key InChIKey=SNZJYXZSEFMOER-UHFFFAOYSA-N
Data  1 IC50
  Tab Delimited (TSV)   2D SDfile   Computed 3D by Vconf -m prep SDfile
Find this compound or compounds like it in BindingDB:
Activity Spreadsheet -- Enzyme Inhibition Constant Data from BindingDB
Found 1 hit for monomerid = 50491665
TargetStructural capsid protein(Human immunodeficiency virus 1)
Boehringer Ingelheim (Canada)
Curated by ChEMBL
LigandPNGBDBM50491665(CHEMBL2387158)
Affinity DataIC50:  180nM. Assay description: Inhibition of HIV1 capsid-nucleocapsid assembly expressed in Escherichia coli BL21(DE3) after 2 hrs by fluorescence assay
Ligand InfoPC cidPC sid
In DepthDetails ArticlePubMed