BDBM50491677 CHEMBL2387175
SMILES CCN1c2ccc(cc2N(c2ccccc2)C(=O)C2(CC(C)c3cc(O)ccc23)C1=O)C(F)(F)F
InChI Key InChIKey=JSGUOWPTTFDGBZ-UHFFFAOYSA-N
Data  1 IC50
  Tab Delimited (TSV)   2D SDfile   Computed 3D by Vconf -m prep SDfile
Find this compound or compounds like it in BindingDB:
Activity Spreadsheet -- Enzyme Inhibition Constant Data from BindingDB
Found 1 hit for monomerid = 50491677
TargetStructural capsid protein(Human immunodeficiency virus 1)
Boehringer Ingelheim (Canada)
Curated by ChEMBL
LigandPNGBDBM50491677(CHEMBL2387175)
Affinity DataIC50:  290nM. Assay description: Inhibition of HIV1 capsid-nucleocapsid assembly expressed in Escherichia coli BL21(DE3) after 2 hrs by fluorescence assay
Ligand InfoPC cidPC sid
In DepthDetails ArticlePubMed