BDBM50491678 CHEMBL2387166
SMILES CCN1c2ccc(cc2N(c2ccccc2)C(=O)C2(CCc3c2cccc3O)C1=O)C(F)(F)F
InChI Key InChIKey=ZFFIAXOCNGXDJI-UHFFFAOYSA-N
Data  1 IC50
  Tab Delimited (TSV)   2D SDfile   Computed 3D by Vconf -m prep SDfile
Find this compound or compounds like it in BindingDB:
Activity Spreadsheet -- Enzyme Inhibition Constant Data from BindingDB
Found 1 hit for monomerid = 50491678
TargetStructural capsid protein(Human immunodeficiency virus 1)
Boehringer Ingelheim (Canada)
Curated by ChEMBL
LigandPNGBDBM50491678(CHEMBL2387166)
Affinity DataIC50:  240nM. Assay description: Inhibition of HIV1 capsid-nucleocapsid assembly expressed in Escherichia coli BL21(DE3) after 2 hrs by fluorescence assay
Ligand InfoPC cidPC sid
In DepthDetails ArticlePubMed