BDBM50491890 CHEMBL2387726
SMILES Cl.[H][C@@]12Oc3c4c(C[C@@]5([H])N(CC6CC6)CC[C@]14[C@@]51CC[C@@]2(O)[C@H](CC(=O)Nc2ccccc2)N1C)ccc3O
InChI Key InChIKey=RRXHFXCTKOEEJU-CLIJKTFFSA-N
Data  3 KI
  Tab Delimited (TSV)   2D SDfile   Computed 3D by Vconf -m prep SDfile
Find this compound or compounds like it in BindingDB:
Activity Spreadsheet -- Enzyme Inhibition Constant Data from BindingDB
Found 3 hits for monomerid = 50491890
TargetKappa-type opioid receptor(Cavia porcellus (domestic guinea pig))
Kitasato University
Curated by ChEMBL
LigandPNGBDBM50491890(CHEMBL2387726)
Affinity DataKi:  0.150nM. Assay description: Displacement of [3H]U-69,593 from kappa opioid receptor in guinea pig cerebellum
Ligand InfoPC cidPC sid
In DepthDetails ArticlePubMed
TargetMu-type opioid receptor(MOUSE)
Kitasato University
Curated by ChEMBL
LigandPNGBDBM50491890(CHEMBL2387726)
Affinity DataKi:  0.360nM. Assay description: Displacement of [3H]DAMGO from mu opioid receptor in mouse whole brain devoid of cerebellum
Ligand InfoPC cidPC sid
In DepthDetails ArticlePubMed
TargetDelta-type opioid receptor(MOUSE)
Kitasato University
Curated by ChEMBL
LigandPNGBDBM50491890(CHEMBL2387726)
Affinity DataKi:  0.360nM. Assay description: Displacement of [3H]DPDPE from delta opioid receptor in mouse whole brain devoid of cerebellum
Ligand InfoPC cidPC sid
In DepthDetails ArticlePubMed