BDBM50491992 CHEMBL2391782
SMILES CC(C)N1c2ccc(cc2CC[C@@H](NC(=O)[C@@H](Cc2ccccc2F)NC(=O)c2ccc(F)cc2C(F)(F)F)C1=O)C(F)(F)F
InChI Key InChIKey=KJUAALNWYDOSAA-JWQCQUIFSA-N
Data  1 IC50
  Tab Delimited (TSV)   2D SDfile   Computed 3D by Vconf -m prep SDfile
Find this compound or compounds like it in BindingDB:
Activity Spreadsheet -- Enzyme Inhibition Constant Data from BindingDB
Found 1 hit for monomerid = 50491992
TargetSodium channel protein type 9 subunit alpha(Homo sapiens (Human))
Merck Research Laboratories
Curated by ChEMBL
LigandPNGBDBM50491992(CHEMBL2391782)
Affinity DataIC50:  359nM. Assay description: Inhibition of human NaV1.7 channel expressed in HEK293 cells by FRET assay
Ligand InfoPC cidPC sid
In DepthDetails ArticlePubMed