BDBM50492972 CHEMBL2415080
SMILES CCCC[C@H](NC(=O)[C@H](CO)NC(=O)CCCCCn1cc(CCCCOC(CCC(O)C(C)CCC(O)C(C)CCC(O)C(C)C)C(C)CCC(O)C(C)CCC(O)C(C)C)nn1)C(=O)N[C@@H](CCC(O)=O)C(=O)N[C@@H](Cc1cnc[nH]1)C(=O)N[C@H](Cc1ccccc1)C(=O)N[C@@H](CCCNC(N)=N)C(=O)N[C@@H](Cc1c[nH]c2ccccc12)C(N)=O
InChI Key InChIKey=MWVQSTGUKQDQFU-SUSIORCISA-N
Data  2 KI
  Tab Delimited (TSV)   2D SDfile   Computed 3D by Vconf -m prep SDfile
Find this compound or compounds like it in BindingDB:
Activity Spreadsheet -- Enzyme Inhibition Constant Data from BindingDB
Found 2 hits for monomerid = 50492972
TargetMelanocortin receptor 4(Homo sapiens (Human))
University Of Arizona
Curated by ChEMBL
LigandPNGBDBM50492972(CHEMBL2415080)
Affinity DataKi:  2.40nM. Assay description: Displacement of Eu-DTPA-PEGOMSH(7) from human MC4R expressed in HEL293 cells after 1 hr by time-resolved fluorescence assay
Ligand InfoPC cidPC sid
In DepthDetails ArticlePubMed
TargetMelanocortin receptor 4(Homo sapiens (Human))
University Of Arizona
Curated by ChEMBL
LigandPNGBDBM50492972(CHEMBL2415080)
Affinity DataKi:  33nM. Assay description: Displacement of Eu-DTPA-PEGO-NDP-alpha-MSH-NH2 from human MC4R expressed in HEL293 cells after 1 hr by time-resolved fluorescence assay
Ligand InfoPC cidPC sid
In DepthDetails ArticlePubMed