BDBM50493373 CHEMBL2425478
SMILES ONC(=O)CC(O)c1cccc(Cl)c1Cl
InChI Key InChIKey=FOXDYWSFBSJBQQ-UHFFFAOYSA-N
Data  1 KI  2 IC50
  Tab Delimited (TSV)   2D SDfile   Computed 3D by Vconf -m prep SDfile
Find this compound or compounds like it in BindingDB:
Activity Spreadsheet -- Enzyme Inhibition Constant Data from BindingDB
Found 3 hits for monomerid = 50493373
TargetUrease subunit beta(Helicobacter pylori (strain ATCC 700392 / 26695) (...)
Jishou University
Curated by ChEMBL
LigandPNGBDBM50493373(CHEMBL2425478)
Affinity DataKi:  45nM. Assay description: Mixed-type competitive inhibition of Helicobacter pylori ATCC 43504 urease using urea as substrate by Lineweaver-burk plot analysis
Ligand InfoPC cidPC sid
In DepthDetails ArticlePubMed
TargetUrease subunit beta(Helicobacter pylori (strain ATCC 700392 / 26695) (...)
Jishou University
Curated by ChEMBL
LigandPNGBDBM50493373(CHEMBL2425478)
Affinity DataIC50:  230nM. Assay description: Inhibition of urease extracted from Helicobacter pylori ATCC 43504 assessed as ammonia production preincubated for 1.5 hrs by indophenol-based method
Ligand InfoPC cidPC sid
In DepthDetails ArticlePubMed
TargetUrease subunit beta(Helicobacter pylori (strain ATCC 700392 / 26695) (...)
Jishou University
Curated by ChEMBL
LigandPNGBDBM50493373(CHEMBL2425478)
Affinity DataIC50:  910nM. Assay description: Inhibition of urease in Helicobacter pylori ATCC 43504 intact cell assessed as ammonia production preincubated for 1.5 hrs by indophenol-based method
Ligand InfoPC cidPC sid
In DepthDetails ArticlePubMed