BDBM50493531 CHEMBL2431532
SMILES COc1ccc(cc1F)-c1ccc(C(=O)N[C@@H](Cc2c[nH]c3ccccc23)C(=O)Nc2ccncc2)c(F)c1
InChI Key InChIKey=PCLXHWXZKLLONS-MHZLTWQESA-N
Data  1 Kd
  Tab Delimited (TSV)   2D SDfile   Computed 3D by Vconf -m prep SDfile
Find this compound or compounds like it in BindingDB:
Activity Spreadsheet -- Enzyme Inhibition Constant Data from BindingDB
Found 1 hit for monomerid = 50493531
TargetSterol 14-alpha demethylase(Trypanosoma cruzi)
Scripps Florida
Curated by ChEMBL
LigandPNGBDBM50493531(CHEMBL2431532)
Affinity DataKd: <5nM. Assay description: Binding affinity to recombinant Trypanosoma cruzi CYP51 expressed in Escherichia coli by UV-Vis spectrophotometric analysis
Ligand InfoPC cidPC sid
In DepthDetails ArticlePubMed