BDBM50493541 CHEMBL2431643
SMILES O=C(Cc1ccccc1)N[C@@H](Cc1c[nH]c2ccccc12)C(=O)Nc1ccncc1
InChI Key InChIKey=TWOUTVYAMZNPSI-QFIPXVFZSA-N
Data  1 Kd
  Tab Delimited (TSV)   2D SDfile   Computed 3D by Vconf -m prep SDfile
Find this compound or compounds like it in BindingDB:
Activity Spreadsheet -- Enzyme Inhibition Constant Data from BindingDB
Found 1 hit for monomerid = 50493541
TargetSterol 14-alpha demethylase(Trypanosoma cruzi)
Scripps Florida
Curated by ChEMBL
LigandPNGBDBM50493541(CHEMBL2431643)
Affinity DataKd: <5nM. Assay description: Binding affinity to recombinant Trypanosoma cruzi CYP51 expressed in Escherichia coli by UV-Vis spectrophotometric analysis
Ligand InfoPC cidPC sid
In DepthDetails ArticlePubMed