BDBM50493566 CHEMBL2431638
SMILES O=C(Nc1ccncc1)[C@H](Cc1csc2ccccc12)NC(=O)C1CCCCC1
InChI Key InChIKey=KNILPWHAWIJUNA-FQEVSTJZSA-N
Data  1 Kd
  Tab Delimited (TSV)   2D SDfile   Computed 3D by Vconf -m prep SDfile
Find this compound or compounds like it in BindingDB:
Activity Spreadsheet -- Enzyme Inhibition Constant Data from BindingDB
Found 1 hit for monomerid = 50493566
TargetSterol 14-alpha demethylase(Trypanosoma cruzi)
Scripps Florida
Curated by ChEMBL
LigandPNGBDBM50493566(CHEMBL2431638)
Affinity DataKd: <5nM. Assay description: Binding affinity to recombinant Trypanosoma cruzi CYP51 expressed in Escherichia coli by UV-Vis spectrophotometric analysis
Ligand InfoPC cidPC sid
In DepthDetails ArticlePubMed