BDBM50493569 CHEMBL2431624
SMILES Fc1cc(ccc1C(=O)N[C@@H](Cc1c[nH]c2ccccc12)C(=O)Nc1ccncc1)-c1ccccc1Cl
InChI Key InChIKey=LYWZYWJFFKMDRR-MHZLTWQESA-N
Data  1 Kd
  Tab Delimited (TSV)   2D SDfile   Computed 3D by Vconf -m prep SDfile
Find this compound or compounds like it in BindingDB:
Activity Spreadsheet -- Enzyme Inhibition Constant Data from BindingDB
Found 1 hit for monomerid = 50493569
TargetSterol 14-alpha demethylase(Trypanosoma cruzi)
Scripps Florida
Curated by ChEMBL
LigandPNGBDBM50493569(CHEMBL2431624)
Affinity DataKd: <5nM. Assay description: Binding affinity to recombinant Trypanosoma cruzi CYP51 expressed in Escherichia coli by UV-Vis spectrophotometric analysis
Ligand InfoPC cidPC sid
In DepthDetails ArticlePubMed