BDBM50495850 CHEMBL3113255
SMILES Cl.Nc1nc(c[nH]1)-c1cccc(NC(=O)c2c[nH]c3ccccc23)c1
InChI Key InChIKey=UMABJCANGQVNJU-UHFFFAOYSA-N
Data  8 IC50
  Tab Delimited (TSV)   2D SDfile   Computed 3D by Vconf -m prep SDfile
Find this compound or compounds like it in BindingDB:
Activity Spreadsheet -- Enzyme Inhibition Constant Data from BindingDB
Found 8 hits for monomerid = 50495850
TargetSodium channel protein type 5 subunit alpha(Homo sapiens (Human))
University Of Ljubljana
Curated by ChEMBL
LigandPNGBDBM50495850(CHEMBL3113255)
Affinity DataIC50: >3.00E+4nM. Assay description: Modulation of human Nav1.5 in closed state assessed as inhibition of inward current after 4 mins by whole-cell electrophysiology
Ligand InfoPC cidPC sid
In DepthDetails ArticlePubMed
TargetSodium channel protein type 9 subunit alpha(Homo sapiens (Human))
University Of Ljubljana
Curated by ChEMBL
LigandPNGBDBM50495850(CHEMBL3113255)
Affinity DataIC50: >3.00E+4nM. Assay description: Modulation of human Nav1.7 in closed state assessed as inhibition of inward current after 4 mins by whole-cell electrophysiology
Ligand InfoPC cidPC sid
In DepthDetails ArticlePubMed
TargetSodium channel protein type 5 subunit alpha(Homo sapiens (Human))
University Of Ljubljana
Curated by ChEMBL
LigandPNGBDBM50495850(CHEMBL3113255)
Affinity DataIC50: >3.00E+4nM. Assay description: Modulation of human Nav1.5 in open-inactivated state assessed as inhibition of inward current after 4 mins by whole-cell electrophysiology
Ligand InfoPC cidPC sid
In DepthDetails ArticlePubMed
TargetSodium channel protein type 3 subunit alpha(Homo sapiens (Human))
University Of Ljubljana
Curated by ChEMBL
LigandPNGBDBM50495850(CHEMBL3113255)
Affinity DataIC50: >3.00E+4nM. Assay description: Modulation of human Nav1.3 in closed state assessed as inhibition of inward current after 4 mins by whole-cell electrophysiology
Ligand InfoPC cidPC sid
In DepthDetails ArticlePubMed
TargetSodium channel protein type 9 subunit alpha(Homo sapiens (Human))
University Of Ljubljana
Curated by ChEMBL
LigandPNGBDBM50495850(CHEMBL3113255)
Affinity DataIC50:  2.60E+4nM. Assay description: Modulation of human Nav1.7 in open-inactivated state assessed as inhibition of inward current after 4 mins by whole-cell electrophysiology
Ligand InfoPC cidPC sid
In DepthDetails ArticlePubMed
TargetSodium channel protein type 4 subunit alpha(Homo sapiens (Human))
University Of Ljubljana
Curated by ChEMBL
LigandPNGBDBM50495850(CHEMBL3113255)
Affinity DataIC50:  1.40E+4nM. Assay description: Modulation of human Nav1.4 in open-inactivated state assessed as inhibition of inward current after 4 mins by whole-cell electrophysiology
Ligand InfoPC cidPC sid
In DepthDetails ArticlePubMed
TargetSodium channel protein type 3 subunit alpha(Homo sapiens (Human))
University Of Ljubljana
Curated by ChEMBL
LigandPNGBDBM50495850(CHEMBL3113255)
Affinity DataIC50:  1.20E+4nM. Assay description: Modulation of human Nav1.3 in open-inactivated state assessed as inhibition of inward current after 4 mins by whole-cell electrophysiology
Ligand InfoPC cidPC sid
In DepthDetails ArticlePubMed
TargetSodium channel protein type 4 subunit alpha(Homo sapiens (Human))
University Of Ljubljana
Curated by ChEMBL
LigandPNGBDBM50495850(CHEMBL3113255)
Affinity DataIC50: >3.00E+4nM. Assay description: Modulation of human Nav1.4 in closed state assessed as inhibition of inward current after 4 mins by whole-cell electrophysiology
Ligand InfoPC cidPC sid
In DepthDetails ArticlePubMed