BDBM50496179 CHEMBL3121865
SMILES CCCCCCOc1ccc2cc(C(=O)OC)c(=O)oc2c1
InChI Key InChIKey=QOKVLUFMBVGFPC-UHFFFAOYSA-N
Data  2 IC50
  Tab Delimited (TSV)   2D SDfile   Computed 3D by Vconf -m prep SDfile
Find this compound or compounds like it in BindingDB:
Activity Spreadsheet -- Enzyme Inhibition Constant Data from BindingDB
Found 2 hits for monomerid = 50496179
TargetAmine oxidase [flavin-containing] B(Homo sapiens (Human))
University Of Bonn
Curated by ChEMBL
LigandPNGBDBM50496179(CHEMBL3121865)
Affinity DataIC50:  0.875nM. Assay description: Inhibition of human recombinant MAO-B expressed in baculovirus infected insect cells assessed as hydrogen peroxide production using p-tyramine as sub...
Ligand InfoPC cidPC sid
In DepthDetails ArticlePubMed
TargetAmine oxidase [flavin-containing] A(Homo sapiens (Human))
University Of Bonn
Curated by ChEMBL
LigandPNGBDBM50496179(CHEMBL3121865)
Affinity DataIC50:  66nM. Assay description: Inhibition of human recombinant MAO-A expressed in baculovirus infected insect cells assessed as hydrogen peroxide production using p-tyramine as sub...
Ligand InfoPC cidPC sid
In DepthDetails ArticlePubMed