BDBM50497040 CHEMBL3248386
SMILES C([C@@H]1COc2ccccc2O1)N1CCCCC1
InChI Key InChIKey=LYKMMUBOEFYJQG-GFCCVEGCSA-N
Data  1 Kd
  Tab Delimited (TSV)   2D SDfile   Computed 3D by Vconf -m prep SDfile
Find this compound or compounds like it in BindingDB:
Activity Spreadsheet -- Enzyme Inhibition Constant Data from BindingDB
Found 1 hit for monomerid = 50497040
LigandPNGBDBM50497040(CHEMBL3248386)
Affinity DataKd:  1.02E+3nM. Assay description: Displacement of [3H]dihydroazapetine from alpha-adrenoreceptor in rat vas deferens
In DepthDetails ArticlePubMed