BDBM50497089 CHEMBL3263091
SMILES [H][C@]12OC[C@H](OC(=O)N[C@@H](Cc3ccccc3)[C@H](O)CN(CC(C)C)S(=O)(=O)c3ccc(OC)cc3)[C@@]1([H])OC[C@H]2OC
InChI Key InChIKey=ARDPYCXCIOGDOV-BUNJHDQMSA-N
Data  6 IC50
  Tab Delimited (TSV)   2D SDfile   Computed 3D by Vconf -m prep SDfile
Find this compound or compounds like it in BindingDB:
Activity Spreadsheet -- Enzyme Inhibition Constant Data from BindingDB
Found 6 hits for monomerid = 50497089
TargetProtease(Human immunodeficiency virus 1 (HIV-1))
Shandong University
Curated by ChEMBL
LigandPNGBDBM50497089(CHEMBL3263091)
Affinity DataIC50:  0.0500nM. Assay description: Inhibition of purified HIV-1 protease using [Arg-Glu(EDANS)-Ser-Gin-Asn-Tyr-Ile-Val-Gin-Lys(dabcyl)-Arg) as fluorogenic substrate by fluorescence ass...
Ligand InfoPC cidPC sid
In DepthDetails ArticlePubMed
TargetProtease(Human immunodeficiency virus 1 (HIV-1))
Shandong University
Curated by ChEMBL
LigandPNGBDBM50497089(CHEMBL3263091)
Affinity DataIC50:  157nM. Assay description: Inhibition of purified HIV-1 protease using [Arg-Glu(EDANS)-Ser-Gin-Asn-Tyr-Ile-Val-Gin-Lys(dabcyl)-Arg) as fluorogenic substrate at 2 ng/ml by fluor...
Ligand InfoPC cidPC sid
In DepthDetails ArticlePubMed
TargetProtease(Human immunodeficiency virus 1 (HIV-1))
Shandong University
Curated by ChEMBL
LigandPNGBDBM50497089(CHEMBL3263091)
Affinity DataIC50:  140nM. Assay description: Inhibition of purified HIV-1 protease using [Arg-Glu(EDANS)-Ser-Gin-Asn-Tyr-Ile-Val-Gin-Lys(dabcyl)-Arg) as fluorogenic substrate at 0.4 ng/ml by flu...
Ligand InfoPC cidPC sid
In DepthDetails ArticlePubMed
TargetProtease(Human immunodeficiency virus 1 (HIV-1))
Shandong University
Curated by ChEMBL
LigandPNGBDBM50497089(CHEMBL3263091)
Affinity DataIC50:  162nM. Assay description: Inhibition of purified HIV-1 protease using [Arg-Glu(EDANS)-Ser-Gin-Asn-Tyr-Ile-Val-Gin-Lys(dabcyl)-Arg) as fluorogenic substrate at 50 ng/ml by fluo...
Ligand InfoPC cidPC sid
In DepthDetails ArticlePubMed
TargetProtease(Human immunodeficiency virus 1 (HIV-1))
Shandong University
Curated by ChEMBL
LigandPNGBDBM50497089(CHEMBL3263091)
Affinity DataIC50:  172nM. Assay description: Inhibition of purified HIV-1 protease using [Arg-Glu(EDANS)-Ser-Gin-Asn-Tyr-Ile-Val-Gin-Lys(dabcyl)-Arg) as fluorogenic substrate at 10 ng/ml by fluo...
Ligand InfoPC cidPC sid
In DepthDetails ArticlePubMed
TargetProtease(Human immunodeficiency virus 1 (HIV-1))
Shandong University
Curated by ChEMBL
LigandPNGBDBM50497089(CHEMBL3263091)
Affinity DataIC50:  90.7nM. Assay description: Inhibition of purified HIV-1 protease using [Arg-Glu(EDANS)-Ser-Gin-Asn-Tyr-Ile-Val-Gin-Lys(dabcyl)-Arg) as fluorogenic substrate at 0.08 ng/ml by fl...
Ligand InfoPC cidPC sid
In DepthDetails ArticlePubMed