BDBM50497414 CHEMBL3339145
SMILES CC1CC1c1cc(NC(=O)Nc2ccc(Cl)cc2)n(CC(F)(F)F)n1
InChI Key InChIKey=RLVXYFXRWPRDDM-UHFFFAOYSA-N
Data  2 EC50
  Tab Delimited (TSV)   2D SDfile   Computed 3D by Vconf -m prep SDfile
Find this compound or compounds like it in BindingDB:
Activity Spreadsheet -- Enzyme Inhibition Constant Data from BindingDB
Found 2 hits for monomerid = 50497414
TargetG protein-activated inward rectifier potassium channel 4(Homo sapiens (Human))
Northwest A&F University
Curated by ChEMBL
LigandPNGBDBM50497414(CHEMBL3339145)
Affinity DataEC50:  1.80E+3nM. Assay description: Activation of GIRK1/4 (unknown origin) by thallium-flux based assay
Ligand InfoPC cidPC sid
In DepthDetails ArticlePubMed
TargetG protein-activated inward rectifier potassium channel 1(Homo sapiens (Human))
Northwest A&F University
Curated by ChEMBL
LigandPNGBDBM50497414(CHEMBL3339145)
Affinity DataEC50:  150nM. Assay description: Activation of GIRK1/2 (unknown origin) by thallium-flux based assay
Ligand InfoPC cidPC sid
In DepthDetails ArticlePubMed