BDBM50497424 CHEMBL3343663
SMILES Cl.[#6]-[#6]C1([#8])c2ccccc2-c2ccc(cc12)-[#6](=O)\[#7]=[#6](\[#7])-[#7]
InChI Key InChIKey=XEABBCMSPCHDTB-UHFFFAOYSA-N
Data  2 KI
  Tab Delimited (TSV)   2D SDfile   Computed 3D by Vconf -m prep SDfile
Find this compound or compounds like it in BindingDB:
Activity Spreadsheet -- Enzyme Inhibition Constant Data from BindingDB
Found 2 hits for monomerid = 50497424
Target5-hydroxytryptamine receptor 7(Homo sapiens (Human))
Astellas Pharma
Curated by ChEMBL
LigandPNGBDBM50497424(CHEMBL3343663)
Affinity DataKi:  1.20nM. Assay description: Displacement of [3H]5-HT from human 5-HT7 receptor expressed in CHO cells
Ligand InfoPC cidPC sid
In DepthDetails ArticlePubMed
Target5-hydroxytryptamine receptor 2B(Homo sapiens (Human))
Astellas Pharma
Curated by ChEMBL
LigandPNGBDBM50497424(CHEMBL3343663)
Affinity DataKi:  41nM. Assay description: Displacement of [3H]mesulergine from human 5-HT2B receptor expressed in HEK293 cells
Ligand InfoPC cidPC sid
In DepthDetails ArticlePubMed