BDBM50497676 CHEMBL3361134
SMILES ONC(=O)CN(CC(=O)NCCCN1CCN(CC1)c1ccccc1)Cc1ccccc1
InChI Key InChIKey=IUROXCIRBMMVMK-UHFFFAOYSA-N
Data  2 IC50
  Tab Delimited (TSV)   2D SDfile   Computed 3D by Vconf -m prep SDfile
Find this compound or compounds like it in BindingDB:
Activity Spreadsheet -- Enzyme Inhibition Constant Data from BindingDB
Found 2 hits for monomerid = 50497676
TargetElastase(Pseudomonas aeruginosa)
Uit - The Arctic University Of Norway
Curated by ChEMBL
LigandPNGBDBM50497676(CHEMBL3361134)
Affinity DataIC50:  6.70E+3nM. Assay description: Inhibition of Pseudomonas aeruginosa pseudolysin using Abz-Ala-Gly-Leu-Ala-p-nitrobenzylamide as substrate after 15 mins
Ligand InfoPC cidPC sid
In DepthDetails ArticlePubMed
TargetElastase(Pseudomonas aeruginosa)
Uit - The Arctic University Of Norway
Curated by ChEMBL
LigandPNGBDBM50497676(CHEMBL3361134)
Affinity DataIC50:  2.80E+3nM. Assay description: Inhibition of Pseudomonas aeruginosa pseudolysin using Mca-Arg-Pro-Pro-Gly-Phe-Ser-Ala-Phe-Lys-(Dnp)-OH as substrate after 1 hr by fluorescence assay...
Ligand InfoPC cidPC sid
In DepthDetails ArticlePubMed