BDBM50498198 CHEBI:48220::Dichlorobenzyl alcohol
SMILES OCc1ccc(Cl)cc1Cl
InChI Key InChIKey=DBHODFSFBXJZNY-UHFFFAOYSA-N
Data  1 KI
  Tab Delimited (TSV)   2D SDfile   Computed 3D by Vconf -m prep SDfile
Find this compound or compounds like it in BindingDB:
Activity Spreadsheet -- Enzyme Inhibition Constant Data from BindingDB
Found 1 hit for monomerid = 50498198
TargetCoagulation factor VII/Tissue factor(Homo sapiens (Human))
Bristol-Myers Squibb
Curated by ChEMBL
LigandPNGBDBM50498198(CHEBI:48220 | Dichlorobenzyl alcohol)
Affinity DataKi:  1.30E+7nM. Assay description: Inhibition of human soluble tissue factor/factor VIIa expressed in Origami B (DE3) using D-Ile-Pro-Arg-pNA as substrate after 30 mins by spectrophoto...
In DepthDetails ArticlePubMed