BDBM50498742 CHEMBL3623094
SMILES Cc1cc(cc(C)c1Oc1ccnc(n1)S(=O)(=O)CC(=O)Nc1cccc(F)c1)C#N
InChI Key InChIKey=KAKUIGOBXFSHPG-UHFFFAOYSA-N
Data  1 IC50
  Tab Delimited (TSV)   2D SDfile   Computed 3D by Vconf -m prep SDfile
Find this compound or compounds like it in BindingDB:
Activity Spreadsheet -- Enzyme Inhibition Constant Data from BindingDB
Found 1 hit for monomerid = 50498742
TargetReverse transcriptase(Human immunodeficiency virus 1)
Fudan University
Curated by ChEMBL
LigandPNGBDBM50498742(CHEMBL3623094)
Affinity DataIC50:  220nM. Assay description: Inhibition of HIV1 reverse transcriptase p66/p51 assessed as inhibition of biotin-dUTP incorporation using poly (rA)/oligo(dT)16 as template/primer i...
Ligand InfoPC cidPC sid
In DepthDetails ArticlePubMed