BDBM50498814 CHEMBL3627876
SMILES COC[C@H]1C[C@@H](O)CN1C(=O)c1cccc(c1)C(=O)N[C@@H](Cc1ccccc1)[C@H](O)CN(CC(C)C)S(=O)(=O)c1ccc(OC)cc1
InChI Key InChIKey=OYZOUBMNHVIJTE-MMJPGJBOSA-N
Data  1 KI
  Tab Delimited (TSV)   2D SDfile   Computed 3D by Vconf -m prep SDfile
Find this compound or compounds like it in BindingDB:
Activity Spreadsheet -- Enzyme Inhibition Constant Data from BindingDB
Found 1 hit for monomerid = 50498814
TargetProtease(Human immunodeficiency virus 1 (HIV-1))
Purdue University
Curated by ChEMBL
LigandPNGBDBM50498814(CHEMBL3627876)
Affinity DataKi:  0.270nM. Assay description: Inhibition of HIV-1 protease by fluorometric assay
Ligand InfoPC cidPC sid
In DepthDetails ArticlePubMed