BDBM50499602 CHEMBL3741973
SMILES NCCCC[C@H](NC(=O)[C@H](Cc1ccc(OP(O)(O)=O)cc1)NC(=O)Cc1ccccc1)C(=O)N1CCC[C@H]1C(=O)N[C@@H](Cc1ccccc1)C(N)=O
InChI Key InChIKey=AKFBTNPRQQHLIY-YDPTYEFTSA-N
Data  1 IC50
  Tab Delimited (TSV)   2D SDfile   Computed 3D by Vconf -m prep SDfile
Find this compound or compounds like it in BindingDB:
Activity Spreadsheet -- Enzyme Inhibition Constant Data from BindingDB
Found 1 hit for monomerid = 50499602
TargetSignal transducer and activator of transcription 6(Homo sapiens (Human))
Rice University
Curated by ChEMBL
LigandPNGBDBM50499602(CHEMBL3741973)
Affinity DataIC50:  4.10E+3nM. Assay description: Inhibition of STAT6 (unknown origin) expressed in Escherichia coli using FAM-Ala-pTyr-Lys-ProPhe-Gln-Asp-Leu-Ile-NH2 as substrate by fluorescence pol...
Ligand InfoKEGGPC cidPC sid
In DepthDetails ArticlePubMed