BDBM50499615 CHEMBL3740751
SMILES NCCCC[C@H](NC(=O)c1cc2cc(OP(O)(O)=O)ccc2o1)C(=O)N1CCC[C@H]1C(=O)N[C@@H](Cc1ccccc1)C(N)=O
InChI Key InChIKey=VHSYDPKYOYFBKB-VABKMULXSA-N
Data  1 IC50
  Tab Delimited (TSV)   2D SDfile   Computed 3D by Vconf -m prep SDfile
Find this compound or compounds like it in BindingDB:
Activity Spreadsheet -- Enzyme Inhibition Constant Data from BindingDB
Found 1 hit for monomerid = 50499615
TargetSignal transducer and activator of transcription 6(Homo sapiens (Human))
Rice University
Curated by ChEMBL
LigandPNGBDBM50499615(CHEMBL3740751)
Affinity DataIC50:  8.96E+4nM. Assay description: Inhibition of STAT6 (unknown origin) expressed in Escherichia coli using FAM-Ala-pTyr-Lys-ProPhe-Gln-Asp-Leu-Ile-NH2 as substrate by fluorescence pol...
Ligand InfoPC cidPC sid
In DepthDetails ArticlePubMed