BDBM50499621 CHEMBL3741480
SMILES CC(=O)N[C@@H](Cc1ccc(OP(O)(O)=O)cc1)C(=O)N[C@@H](CCCCN)C(=O)N1CCC[C@H]1C(=O)N[C@@H](Cc1ccccc1)C(N)=O
InChI Key InChIKey=VGBQTDQLVKPVIO-FWEHEUNISA-N
Data  1 IC50
  Tab Delimited (TSV)   2D SDfile   Computed 3D by Vconf -m prep SDfile
Find this compound or compounds like it in BindingDB:
Activity Spreadsheet -- Enzyme Inhibition Constant Data from BindingDB
Found 1 hit for monomerid = 50499621
TargetSignal transducer and activator of transcription 6(Homo sapiens (Human))
Rice University
Curated by ChEMBL
LigandPNGBDBM50499621(CHEMBL3741480)
Affinity DataIC50:  6.10E+3nM. Assay description: Inhibition of STAT6 (unknown origin) expressed in Escherichia coli using FAM-Ala-pTyr-Lys-ProPhe-Gln-Asp-Leu-Ile-NH2 as substrate by fluorescence pol...
Ligand InfoKEGGPC cidPC sid
In DepthDetails ArticlePubMed