BDBM50499703 CHEMBL3740862
SMILES CCOC(=O)C1C(N(C(CC1=O)c1ccccn1)c1ccccc1)c1ccccn1
InChI Key InChIKey=OBYNRBKAUUYVRB-UHFFFAOYSA-N
Data  2 IC50
  Tab Delimited (TSV)   2D SDfile   Computed 3D by Vconf -m prep SDfile
Find this compound or compounds like it in BindingDB:
Activity Spreadsheet -- Enzyme Inhibition Constant Data from BindingDB
Found 2 hits for monomerid = 50499703
TargetAminopeptidase N(Sus scrofa (Pig))
Csir-Indian Institute Of Chemical Technology
Curated by ChEMBL
LigandPNGBDBM50499703(CHEMBL3740862)
Affinity DataIC50: >1.00E+5nM. Assay description: Inhibition of porcine aminopeptidase-N using Leu-pNA as substrate after 30 mins
Ligand InfoPC cidPC sid
In DepthDetails ArticlePubMed
TargetPuromycin-sensitive aminopeptidase(Homo sapiens (Human))
Csir-Indian Institute Of Chemical Technology
Curated by ChEMBL
LigandPNGBDBM50499703(CHEMBL3740862)
Affinity DataIC50:  9.29E+4nM. Assay description: Inhibition of recombinant human puromycin sensitive aminopeptidase using Leu-pNA as substrate after 30 mins
Ligand InfoPC cidPC sid
In DepthDetails ArticlePubMed