BDBM50499708 CHEMBL3739649
SMILES OC1=CC(N(C(C1)c1ccccn1)c1ccccc1)c1ccccn1
InChI Key InChIKey=IVNGSWABQQWLNF-UHFFFAOYSA-N
Data  2 IC50
  Tab Delimited (TSV)   2D SDfile   Computed 3D by Vconf -m prep SDfile
Find this compound or compounds like it in BindingDB:
Activity Spreadsheet -- Enzyme Inhibition Constant Data from BindingDB
Found 2 hits for monomerid = 50499708
TargetPuromycin-sensitive aminopeptidase(Homo sapiens (Human))
Csir-Indian Institute Of Chemical Technology
Curated by ChEMBL
LigandPNGBDBM50499708(CHEMBL3739649)
Affinity DataIC50:  3.64E+4nM. Assay description: Inhibition of recombinant human puromycin sensitive aminopeptidase using Leu-pNA as substrate after 30 mins
Ligand InfoPC cidPC sid
In DepthDetails ArticlePubMed
TargetAminopeptidase N(Sus scrofa (Pig))
Csir-Indian Institute Of Chemical Technology
Curated by ChEMBL
LigandPNGBDBM50499708(CHEMBL3739649)
Affinity DataIC50: >1.00E+5nM. Assay description: Inhibition of porcine aminopeptidase-N using Leu-pNA as substrate after 30 mins
Ligand InfoPC cidPC sid
In DepthDetails ArticlePubMed