BDBM50499712 CHEMBL3741833
SMILES CCOC(=O)C1=C(CC(N(C1c1ccccn1)c1ccccc1)c1ccc(cc1)C#N)Nc1ccccc1
InChI Key InChIKey=GSIPZXHENXMWMP-UHFFFAOYSA-N
Data  2 IC50
  Tab Delimited (TSV)   2D SDfile   Computed 3D by Vconf -m prep SDfile
Find this compound or compounds like it in BindingDB:
Activity Spreadsheet -- Enzyme Inhibition Constant Data from BindingDB
Found 2 hits for monomerid = 50499712
TargetPuromycin-sensitive aminopeptidase(Homo sapiens (Human))
Csir-Indian Institute Of Chemical Technology
Curated by ChEMBL
LigandPNGBDBM50499712(CHEMBL3741833)
Affinity DataIC50:  3.27E+4nM. Assay description: Inhibition of recombinant human puromycin sensitive aminopeptidase using Leu-pNA as substrate after 30 mins
Ligand InfoPC cidPC sid
In DepthDetails ArticlePubMed
TargetAminopeptidase N(Sus scrofa (Pig))
Csir-Indian Institute Of Chemical Technology
Curated by ChEMBL
LigandPNGBDBM50499712(CHEMBL3741833)
Affinity DataIC50: >1.00E+5nM. Assay description: Inhibition of porcine aminopeptidase-N using Leu-pNA as substrate after 30 mins
Ligand InfoPC cidPC sid
In DepthDetails ArticlePubMed