BDBM50499825 CHEMBL3741716
SMILES C[C@H]1Cn2c(CN1C(=O)c1cccc(c1)C(F)(F)c1n[nH]c(=O)c3ccccc13)nnc2C(C)(C)C
InChI Key InChIKey=XPOZGODXWKHLKI-HNNXBMFYSA-N
Data  1 EC50
  Tab Delimited (TSV)   2D SDfile   Computed 3D by Vconf -m prep SDfile
Find this compound or compounds like it in BindingDB:
Activity Spreadsheet -- Enzyme Inhibition Constant Data from BindingDB
Found 1 hit for monomerid = 50499825
TargetPoly [ADP-ribose] polymerase 1(Homo sapiens (Human))
Astrazeneca
Curated by ChEMBL
LigandPNGBDBM50499825(CHEMBL3741716)
Affinity DataEC50:  87nM. Assay description: Inhibition of PARP in human HeLa cells assessed as induction of centrosome declustering after 48 hrs by DAPI-staining based image analysis
Ligand InfoPC cidPC sid
In DepthDetails ArticlePubMed