BDBM50499939 CHEMBL3740058
SMILES [H][C@]1(NC(=O)[C@@H](Cc2ccccc2)NC(=O)[C@H](CC(C)C)NC(=O)\C(=C/c2ccc(O)cc2)N(C)C(=O)[C@@H](NC(=O)\C=C\c2ccccc2\C=C/CCC)[C@@H](C)OC(=O)[C@H](CO)NC(=O)[C@H](CC(N)=O)NC1=O)[C@H](C)O
InChI Key InChIKey=BVVWVQZZLUNSNV-QMXPZCTJSA-N
Data  1 IC50
  Tab Delimited (TSV)   2D SDfile   Computed 3D by Vconf -m prep SDfile
Find this compound or compounds like it in BindingDB:
Activity Spreadsheet -- Enzyme Inhibition Constant Data from BindingDB
Found 1 hit for monomerid = 50499939
TargetAccessory gene regulator protein A(Staphylococcus aureus)
Toyama Prefectural University
Curated by ChEMBL
LigandPNGBDBM50499939(CHEMBL3740058)
Affinity DataIC50:  2.50E+3nM. Assay description: Inhibition of agr-mediated quorum sensing in Staphylococcus aureus after 5 hrs by luminescence analysis
Ligand InfoPC cidPC sid
In DepthDetails ArticlePubMed