BDBM50500153 CHEMBL3746851
SMILES OC(=O)C(F)(F)F.Cn1cc(CNC(=O)\N=C(\N)NCCC[C@@H](NC(=O)C(c2ccccc2)c2ccccc2)C(=O)NCc2ccc(O)cc2)nn1
InChI Key InChIKey=SSJHOWOSZWKADG-HZPIKELBSA-N
Data  7 KI  6 IC50
  Tab Delimited (TSV)   2D SDfile   Computed 3D by Vconf -m prep SDfile
Find this compound or compounds like it in BindingDB:
Activity Spreadsheet -- Enzyme Inhibition Constant Data from BindingDB
Found 13 hits for monomerid = 50500153
TargetNeuropeptide Y receptor type 1(Homo sapiens (Human))
Cnrs/Ipbs (Institut De Pharmacologie Et Biologie Structurale)
Curated by ChEMBL
LigandPNGBDBM50500153(CHEMBL3746851)
Affinity DataKi:  0.340nM. Assay description: Displacement of [3H]UR-MK136 from NPY1R in human SK-N-MC cells by radioligand binding assay
Ligand InfoPC cidPC sid
In DepthDetails ArticlePubMed
TargetNeuropeptide Y receptor type 1(Homo sapiens (Human))
Cnrs/Ipbs (Institut De Pharmacologie Et Biologie Structurale)
Curated by ChEMBL
LigandPNGBDBM50500153(CHEMBL3746851)
Affinity DataKi:  0.560nM. Assay description: Displacement of [3H]UR-MK114 from NPY1R in human SK-N-MC cells by radioligand binding assay
Ligand InfoPC cidPC sid
In DepthDetails ArticlePubMed
TargetNeuropeptide FF receptor 1(Homo sapiens (Human))
Cnrs/Ipbs (Institut De Pharmacologie Et Biologie Structurale)
Curated by ChEMBL
LigandPNGBDBM50500153(CHEMBL3746851)
Affinity DataKi:  630nM. Assay description: Displacement of [3H]NPVF from human NPFF1 expressed in CHO cells by radioligand binding assay
Ligand InfoPC cidPC sid
In DepthDetails ArticlePubMed
TargetNeuropeptide FF receptor 2(Homo sapiens (Human))
Cnrs/Ipbs (Institut De Pharmacologie Et Biologie Structurale)
Curated by ChEMBL
LigandPNGBDBM50500153(CHEMBL3746851)
Affinity DataKi:  1.20E+3nM. Assay description: Displacement of [3H]EYF from human NPFF2 expressed in CHO cells by radioligand binding assay
Ligand InfoPC cidPC sid
In DepthDetails ArticlePubMed
TargetNeuropeptide Y receptor type 5(Homo sapiens (Human))
Cnrs/Ipbs (Institut De Pharmacologie Et Biologie Structurale)
Curated by ChEMBL
LigandPNGBDBM50500153(CHEMBL3746851)
Affinity DataKi: >1.00E+4nM. Assay description: Displacement of Cy5-pNPY from human NPY5R expressed in HEC cells by flow cytometric analysis
Ligand InfoPC cidPC sid
In DepthDetails ArticlePubMed
TargetNeuropeptide Y receptor type 2(Homo sapiens (Human))
Cnrs/Ipbs (Institut De Pharmacologie Et Biologie Structurale)
Curated by ChEMBL
LigandPNGBDBM50500153(CHEMBL3746851)
Affinity DataKi: >1.00E+4nM. Assay description: Displacement of Cy5-pNPY from human NPY2R expressed in CHO cells by flow cytometric analysis
Ligand InfoPC cidPC sid
In DepthDetails ArticlePubMed
TargetNeuropeptide Y receptor type 4(Homo sapiens (Human))
Cnrs/Ipbs (Institut De Pharmacologie Et Biologie Structurale)
Curated by ChEMBL
LigandPNGBDBM50500153(CHEMBL3746851)
Affinity DataKi: >1.00E+4nM. Assay description: Displacement of Cy5-[K4]hPP from human NPY4R expressed in CHO cells by flow cytometric analysis
Ligand InfoPC cidPC sid
In DepthDetails ArticlePubMed
TargetNeuropeptide Y receptor type 1(Homo sapiens (Human))
Cnrs/Ipbs (Institut De Pharmacologie Et Biologie Structurale)
Curated by ChEMBL
LigandPNGBDBM50500153(CHEMBL3746851)
Affinity DataIC50:  0.195nM. Assay description: Antagonist activity at NPY1R in human HEL cells assessed as inhibition of 10 nM pNPY-induced Ca+2 response preincubated for 15 mins by Fura-2 dye bas...
Ligand InfoPC cidPC sid
In DepthDetails ArticlePubMed
TargetNeuropeptide Y receptor type 1(Homo sapiens (Human))
Cnrs/Ipbs (Institut De Pharmacologie Et Biologie Structurale)
Curated by ChEMBL
LigandPNGBDBM50500153(CHEMBL3746851)
Affinity DataIC50:  0.347nM. Assay description: Antagonist activity at NPY1R in human HEL cells assessed as inhibition of 10 nM pNPY-induced Ca+2 response preincubated for 5 mins by Fura-2 dye base...
Ligand InfoPC cidPC sid
In DepthDetails ArticlePubMed
TargetNeuropeptide Y receptor type 1(Homo sapiens (Human))
Cnrs/Ipbs (Institut De Pharmacologie Et Biologie Structurale)
Curated by ChEMBL
LigandPNGBDBM50500153(CHEMBL3746851)
Affinity DataIC50:  4.30nM. Assay description: Antagonist activity at NPY1R in human HEL cells assessed as inhibition of 10 nM pNPY-induced Ca+2 response preincubated for 10 secs by Fura-2 dye bas...
Ligand InfoPC cidPC sid
In DepthDetails ArticlePubMed
TargetNeuropeptide Y receptor type 1(Homo sapiens (Human))
Cnrs/Ipbs (Institut De Pharmacologie Et Biologie Structurale)
Curated by ChEMBL
LigandPNGBDBM50500153(CHEMBL3746851)
Affinity DataIC50:  1.70nM. Assay description: Antagonist activity at NPY1R in human HEL cells assessed as inhibition of 10 nM pNPY-induced Ca+2 response preincubated for 1 min by Fura-2 dye based...
Ligand InfoPC cidPC sid
In DepthDetails ArticlePubMed
TargetNeuropeptide Y receptor type 1(Homo sapiens (Human))
Cnrs/Ipbs (Institut De Pharmacologie Et Biologie Structurale)
Curated by ChEMBL
LigandPNGBDBM50500153(CHEMBL3746851)
Affinity DataIC50:  0.871nM. Assay description: Antagonist activity at NPY1R in human HEL cells assessed as inhibition of 10 nM pNPY-induced Ca+2 response preincubated for 2 mins by Fura-2 dye base...
Ligand InfoPC cidPC sid
In DepthDetails ArticlePubMed
TargetNeuropeptide Y receptor type 1(Homo sapiens (Human))
Cnrs/Ipbs (Institut De Pharmacologie Et Biologie Structurale)
Curated by ChEMBL
LigandPNGBDBM50500153(CHEMBL3746851)
Affinity DataIC50:  0.219nM. Assay description: Antagonist activity at NPY1R in human HEL cells assessed as inhibition of 10 nM pNPY-induced Ca+2 response preincubated for 10 mins by Fura-2 dye bas...
Ligand InfoPC cidPC sid
In DepthDetails ArticlePubMed