BDBM50500319 CHEMBL3746179
SMILES Cc1cc2c(cccc2n1-c1nc2CCNCc2c(NCc2ccccc2)n1)-c1nnn[nH]1
InChI Key InChIKey=QYBPGHMDCTUFOJ-UHFFFAOYSA-N
Data  1 IC50
  Tab Delimited (TSV)   2D SDfile   Computed 3D by Vconf -m prep SDfile
Find this compound or compounds like it in BindingDB:
Activity Spreadsheet -- Enzyme Inhibition Constant Data from BindingDB
Found 1 hit for monomerid = 50500319
TargetTransitional endoplasmic reticulum ATPase(Homo sapiens (Human))
Cleave Biosciences
Curated by ChEMBL
LigandPNGBDBM50500319(CHEMBL3746179)
Affinity DataIC50:  15nM. Assay description: Inhibition of human p97 ATPase incubated for 15 mins by ADP Glo luminescence assay
Ligand InfoPC cidPC sid
In DepthDetails ArticlePubMed